Home > Error Code > Error Code 0x36b1 14001

Error Code 0x36b1 14001


The value has invalid type, is outside of valid range, can't be updated or is not supported by this type of channel. ERROR_EVT_INVALID_PUBLISHER_PROPERTY_VALUE 15024 (0x3AB0) Publisher property %1!s! The most likely reason for this is lack of domain membership. IObit Performance Security Utilities Store Support ERROR_EAS_NOT_SUPPORTED 282 (0×11A) - Windows Error Information ERROR_SXS_CANT_GEN_ACTCTX 14001 (0X36B1) means: The application has failed to start because its side-by-side configuration is incorrect. Please symplify it or split it into two or more simple expressions. ERROR_EVT_MESSAGE_NOT_FOUND 15027 (0x3AB3) the message resource is present but the message is not found in the string/message table. Source

Fix ERROR_SXS_CANT_GEN_ACTCTX 14001 (0X36B1) Now! I have come across a situation where I had to use to DLL created in VS2005. This page shows you how to repair Error 14001 - Error Code 0x36B1 and related errors. All Rights Reserved.

Windows Error 1400

What is the HTTP promise object in AngularJS? Please try the request again. So how to solve the Windows error codes forever, like ERROR_SXS_CANT_GEN_ACTCTX 14001 (0X36B1)? Please fix the policy on the peer machine. ERROR_IPSEC_IKE_INVALID_MAJOR_VERSION 13880 (0x3638) The recipient cannot handle version of IKE specified in the header. ERROR_IPSEC_IKE_INVALID_CERT_KEYLEN 13881 (0x3639) Key length in certificate

  1. ERROR_SXS_CANT_GEN_ACTCTX 14001 (0X36B1) may bring you unrelated window dialogs.
  2. This error implies that the monitor violated the MCCS 2.0 or MCCS 2.0 Revision 1 specification. ERROR_MCA_UNSUPPORTED_COLOR_TEMPERATURE 15207 (0x3B67) The caller of SetMonitorColorTemperature specified a color temperature that the current
  3. Any idea in which direction to look is highly appreciated.

share|improve this answer edited Nov 21 '11 at 2:36 answered Nov 21 '11 at 2:31 vitakot 2,67811843 add a comment| up vote 3 down vote Look in the eventviewer. The automatically window dialogs affected computer’s performance, causing computer slow down, "play dead" in period, blue screen and system trash. React functional stateless component, PureComponent, Component; what are the differences and when should we use what? The Size Of The Manifest Exceeds The Maximum Allowed Why do Internet forums tend to prohibit responding to inactive threads?

If you have additional suggestions regarding the System Error Codes documentation, given the constraints enumerated at the top of the page, please click the link labeled "Send comments about this topic Please contact your software vendor. ERROR_REMOVE_FAILED 15610 (0x3CFA) Removal failed. This is normal if your computer is a member of a workgroup. ERROR_IPSEC_IKE_SRVQUERYCRED 13856 (0x3620) Failed to determine SSPI principal name for ISAKMP/ERROR_IPSEC_IKE service (QueryCredentialsAttributes). ERROR_IPSEC_IKE_GETSPIFAIL 13857 (0x3621) Failed directory Enable the Windows Firewall service and try again. APPMODEL_ERROR_NO_PACKAGE 15700 (0x3D54) The process has no package identity. APPMODEL_ERROR_PACKAGE_RUNTIME_CORRUPT 15701 (0x3D55) The package runtime information is corrupted. APPMODEL_ERROR_PACKAGE_IDENTITY_CORRUPT 15702

more hot questions question feed lang-cpp about us tour help blog chat data legal privacy policy work here advertising info mobile contact us feedback Technology Life / Arts Culture / Recreation Windows Error Codes List Please see the application event log or use the command-line sxstrace.exe tools for more detail. Kerberos authentication will not function. If the problem persists, reduce the load on the faulting machine. ERROR_IPSEC_IKE_INVALID_POLICY 13861 (0x3625) Invalid policy. ERROR_IPSEC_IKE_UNKNOWN_DOI 13862 (0x3626) Invalid DOI. ERROR_IPSEC_IKE_INVALID_SITUATION 13863 (0x3627) Invalid situation. ERROR_IPSEC_IKE_DH_FAILURE


Privacy statement Dev Centers Windows Office More... Not the answer you're looking for? Windows Error 1400 Check IE9 testing center Marked as answer by Yi Feng LiModerator Tuesday, October 12, 2010 2:00 AM Tuesday, October 05, 2010 3:33 PM Reply | Quote All replies 0 Sign in Error_sxs_key_not_found If you choose to participate, the online survey will be presented to you when you leave the Msdn Web site.Would you like to participate?

Try reinstalling the application to fix the problem. ERROR_INSTALL_PREREQUISITE_FAILED 15613 (0x3CFD) A Prerequisite for an install could not be satisfied. ERROR_PACKAGE_REPOSITORY_CORRUPTED 15614 (0x3CFE) The package repository is corrupted. Join them; it only takes a minute: Sign up LoadLibrary fails with error code 14001 up vote 6 down vote favorite I'm using Visual C++ 2008 Express Edition to create a Most likely VC runtime try installing both of runtime and next phone is Windows Phone 7 and my current browser is IE 9. This may be due to a trailing comma, more than two unnamed attributes, missing attribute name or missing attribute value. ERROR_MALFORMED_SUBSTITUTION_STRING 14094 (0x370E) A string containing localized substitutable content was Error_ipsec_ike_policy_match

Faster!! experts will email you personally within 30 minutes.. Please contact your system administrator. ERROR_PACKAGES_IN_USE 15618 (0x3D02) The package could not be installed because resources it modifies are currently in use. ERROR_RECOVERY_FILE_CORRUPT 15619 (0x3D03) The package could not have a peek here To obtain support for a Microsoft product, go to

Submit File Details Form ©2009 | Privacy Policy Resources Sitemap System Error Code 14001|Fix Windows Registry Errors|Fix Error Code 14001 current community chat Stack Overflow Meta Stack Overflow Error Code 15001 Office 365 Likely it would be a VC CRT runtime which you will have to bundle with your dll. (the VC redistributable is available here: share|improve this answer answered Nov 21 '11 This is not a real failure. ERROR_IPSEC_IKE_INVALID_RESPONDER_LIFETIME_NOTIFY 13879 (0x3637) The lifetime value received in the Responder Lifetime Notify is below the Windows 2000 configured minimum value.

Always scan files you download for viruses before accessing them.

These options seem to be the workarounds for other people having the same issue. This error also manifests difficulty or problem. Why is the article "the" used in "the events?" How to explain lack of flatland? Windows Error Codes Lookup XoftSpySE Anti-Spyware With a lightning fast free scan and the largest authentic spyware detection database we have seen, XoftSpySE Anti-Spyware finds and removes threats that other spyware programs fail to detect.

New main mode will be started. ERROR_IPSEC_IKE_MM_EXPIRED 13885 (0x363D) Main mode SA lifetime expired or peer sent a main mode delete. ERROR_IPSEC_IKE_PEER_MM_ASSUMED_INVALID 13886 (0x363E) Main mode SA assumed to it is highly recommended to take a free scan and fix ERROR_SXS_CANT_GEN_ACTCTX 14001 (0X36B1) Windows errors in time. The run level for a service must not be higher than the run level of its dependent services. ERROR_RUNLEVEL_SWITCH_TIMEOUT 15402 (0x3C2A) The requested run level switch cannot be completed successfully Check This Out Generated Mon, 21 Nov 2016 02:22:02 GMT by s_fl369 (squid/3.5.20)

See ASP.NET Ajax CDN Terms of Use – ]]> Sign in Gallery MSDN Library Forums Get started for The system returned: (22) Invalid argument The remote host or network may be down. System Error Codes (12000-15999) Note  The information on this page is intended to be used by programmers so that the software they write can better deal with errors. They have been extremely useful in our own pc troubleshooting and maintainance and we highly recommend trying them out for yourself.

My first step was to install the latest Microsoft Visual C++ 2008 Redistributable Package but that didn't solved the problem. Home > Resources > ERROR_NOT_ENOUGH_MEMORY 8 (0x8) Warning: include(sidebar1.php): failed to open stream: No such file or directory in /home/antonio/public_html/wp-content/themes/IObit/error-codes-single.php on line 61 Warning: include(sidebar1.php): failed to open stream: No such Below are listed a few tasks for you to familiarize yourself with to keep your pc running at it's best: Keep your operating system, software applications and device drivers updated with Keep these applications updated to protect your pc against the latest malware threats.

Try refreshing the PC to fix the problem. ERROR_APPX_INTEGRITY_FAILURE_CLR_NGEN 15624 (0x3D08) A corrupted CLR NGEN binary was detected on the system. ERROR_RESILIENCY_FILE_CORRUPT 15625 (0x3D09) The operation could not be

© Copyright 2017 All rights reserved.